Home Tutorials Download Beta Store Forum Documentation KnowledgeBase Wiki Blog

ShiVa3D

Return to Google Android

UAT error when trying to build for Android.

Google Play Store, Amazon Kindle, Nook, and so many more

UAT error when trying to build for Android.

Postby saphirekosmos » 24 Feb 2012, 06:27

Hi I am getting an error when trying to build and I have no clue what is causing it. I have checked all over the forums and have yet to find a solution.

Here is the entire log

Code: Select all
-----------------------------------------------------------------------------
--    New build for Android (tool version: 1.3.1)
-----------------------------------------------------------------------------
Authoring type: Application
Build type: Development
AIModels type: Native
Architecture type: armv5te and armv7a
Validating application content
Validating tools path
Using Android NDK : C:android-ndk-r7b
Using Android SDK : C:Program Files (x86)Androidandroid-sdk
Using Cygwin : C:cygwin
Creating Android project
Deleted directory: C:/School/495/Publishing/Android/Build_Temp/_S3DTempBuild_/path_test_20120216_Android.s3dxproj
Created directory: C:/School/495/Publishing/Android/Build_Temp/_S3DTempBuild_/path_test_20120216_Android.s3dxproj
Created directory: C:/Users/Gabriel/Desktop
Created directory C:School495PublishingAndroidBuild_Temp_S3DTempBuild_path_test_20120216_Android.s3dxprojsrccomgabetest
Added file C:School495PublishingAndroidBuild_Temp_S3DTempBuild_path_test_20120216_Android.s3dxprojsrccomgabetestpath_test_20120216.java
Created directory C:School495PublishingAndroidBuild_Temp_S3DTempBuild_path_test_20120216_Android.s3dxprojres
Created directory C:School495PublishingAndroidBuild_Temp_S3DTempBuild_path_test_20120216_Android.s3dxprojbin
Created directory C:School495PublishingAndroidBuild_Temp_S3DTempBuild_path_test_20120216_Android.s3dxprojlibs
Created directory C:School495PublishingAndroidBuild_Temp_S3DTempBuild_path_test_20120216_Android.s3dxprojresvalues
Added file C:School495PublishingAndroidBuild_Temp_S3DTempBuild_path_test_20120216_Android.s3dxprojresvaluesstrings.xml
Created directory C:School495PublishingAndroidBuild_Temp_S3DTempBuild_path_test_20120216_Android.s3dxprojreslayout
Added file C:School495PublishingAndroidBuild_Temp_S3DTempBuild_path_test_20120216_Android.s3dxprojreslayoutmain.xml
Added file C:School495PublishingAndroidBuild_Temp_S3DTempBuild_path_test_20120216_Android.s3dxprojAndroidManifest.xml
Added file C:School495PublishingAndroidBuild_Temp_S3DTempBuild_path_test_20120216_Android.s3dxprojbuild.xml
Added file C:School495PublishingAndroidBuild_Temp_S3DTempBuild_path_test_20120216_Android.s3dxprojproguard.cfg

'xcopy' is not recognized as an internal or external command,
operable program or batch file.
The system cannot find the path specified.
The system cannot find the path specified.
The system cannot find the path specified.
The system cannot find the path specified.
The system cannot find the path specified.
The system cannot find the path specified.
The system cannot find the path specified.
The system cannot find the path specified.
The system cannot find the path specified.
The system cannot find the path specified.
The system cannot find the path specified.
The system cannot find the path specified.
The system cannot find the path specified.
The system cannot find the path specified.
The system cannot find the path specified.
The system cannot find the path specified.
The system cannot find the path specified.
The system cannot find the path specified.

Initializing NDK Android environment
Copied file: C:/Users/Gabriel/Desktop/path_test_20120216.stk to: C:/School/495/Publishing/Android/Build_Temp/_S3DTempBuild_/path_test_20120216_Android.s3dxproj/assets/S3DMain.smf
Copied file: C:/Program Files (x86)/Stonetrip/ShiVa Authoring Tool/Data/Windows/Android/Build/Icon.png to: C:/School/495/Publishing/Android/Build_Temp/_S3DTempBuild_/path_test_20120216_Android.s3dxproj/res/drawable/app_icon.png
Copied file: C:/Program Files (x86)/Stonetrip/ShiVa Authoring Tool/Data/Windows/Android/Build/Default.png to: C:/School/495/Publishing/Android/Build_Temp/_S3DTempBuild_/path_test_20120216_Android.s3dxproj/res/drawable/app_splash.png
Copied file: C:/Program Files (x86)/Stonetrip/ShiVa Authoring Tool/Data/Windows/Android/Build/app_main.xml to: C:/School/495/Publishing/Android/Build_Temp/_S3DTempBuild_/path_test_20120216_Android.s3dxproj/res/layout/main.xml
Creating engine wrapper
Copied file: C:/Program Files (x86)/Stonetrip/ShiVa Authoring Tool/Data/Windows/Android/Build/S3DClientNative_Android_arm_v5te_GLES1.a to: C:/School/495/Publishing/Android/Build_Temp/_S3DTempBuild_/path_test_20120216_Android.s3dxproj/obj/local/armeabi/libS3DClientNative_Android.a
Copied file: C:/Program Files (x86)/Stonetrip/ShiVa Authoring Tool/Data/Windows/Android/Build/S3DClientNative_Android_arm_v7a_GLES1.a to: C:/School/495/Publishing/Android/Build_Temp/_S3DTempBuild_/path_test_20120216_Android.s3dxproj/obj/local/armeabi-v7a/libS3DClientNative_Android.a
Copied file: C:/Program Files (x86)/Stonetrip/ShiVa Authoring Tool/Data/Windows/Android/Build/S3DClient_Wrapper.h to: C:/School/495/Publishing/Android/Build_Temp/_S3DTempBuild_/path_test_20120216_Android.s3dxproj/jni/S3DClient_Wrapper.h
Copied file: C:/Program Files (x86)/Stonetrip/ShiVa Authoring Tool/Data/Windows/Android/Build/libopenal_arm_v5te.so to: C:/School/495/Publishing/Android/Build_Temp/_S3DTempBuild_/path_test_20120216_Android.s3dxproj/obj/local/armeabi/libopenal.so
Copied file: C:/Program Files (x86)/Stonetrip/ShiVa Authoring Tool/Data/Windows/Android/Build/libcrypto_arm_v5te.so to: C:/School/495/Publishing/Android/Build_Temp/_S3DTempBuild_/path_test_20120216_Android.s3dxproj/obj/local/armeabi/libcrypto.so
Copied file: C:/Program Files (x86)/Stonetrip/ShiVa Authoring Tool/Data/Windows/Android/Build/libssl_arm_v5te.so to: C:/School/495/Publishing/Android/Build_Temp/_S3DTempBuild_/path_test_20120216_Android.s3dxproj/obj/local/armeabi/libssl.so
Copied file: C:/Program Files (x86)/Stonetrip/ShiVa Authoring Tool/Data/Windows/Android/Build/libopenal_arm_v7a.so to: C:/School/495/Publishing/Android/Build_Temp/_S3DTempBuild_/path_test_20120216_Android.s3dxproj/obj/local/armeabi-v7a/libopenal.so
Copied file: C:/Program Files (x86)/Stonetrip/ShiVa Authoring Tool/Data/Windows/Android/Build/libcrypto_arm_v7a.so to: C:/School/495/Publishing/Android/Build_Temp/_S3DTempBuild_/path_test_20120216_Android.s3dxproj/obj/local/armeabi-v7a/libcrypto.so
Copied file: C:/Program Files (x86)/Stonetrip/ShiVa Authoring Tool/Data/Windows/Android/Build/libssl_arm_v7a.so to: C:/School/495/Publishing/Android/Build_Temp/_S3DTempBuild_/path_test_20120216_Android.s3dxproj/obj/local/armeabi-v7a/libssl.so
Copied file: C:/Users/Gabriel/Desktop/path_test_23_20120216_Sources/human_State_main_onLoop.cpp to: C:/School/495/Publishing/Android/Build_Temp/_S3DTempBuild_/path_test_20120216_Android.s3dxproj/jni/AIModels/human_State_main_onLoop.cpp
Copied file: C:/Users/Gabriel/Desktop/path_test_23_20120216_Sources/main.cpp to: C:/School/495/Publishing/Android/Build_Temp/_S3DTempBuild_/path_test_20120216_Android.s3dxproj/jni/AIModels/main.cpp
Copied file: C:/Users/Gabriel/Desktop/path_test_23_20120216_Sources/main.h to: C:/School/495/Publishing/Android/Build_Temp/_S3DTempBuild_/path_test_20120216_Android.s3dxproj/jni/AIModels/main.h
Copied file: C:/Users/Gabriel/Desktop/path_test_23_20120216_Sources/main_Handler_onInit.cpp to: C:/School/495/Publishing/Android/Build_Temp/_S3DTempBuild_/path_test_20120216_Android.s3dxproj/jni/AIModels/main_Handler_onInit.cpp
Copied file: C:/Users/Gabriel/Desktop/path_test_23_20120216_Sources/main_Handler_onMouseButtonDown.cpp to: C:/School/495/Publishing/Android/Build_Temp/_S3DTempBuild_/path_test_20120216_Android.s3dxproj/jni/AIModels/main_Handler_onMouseButtonDown.cpp
Copied file: C:/Users/Gabriel/Desktop/path_test_23_20120216_Sources/path_test_Plugins.cpp to: C:/School/495/Publishing/Android/Build_Temp/_S3DTempBuild_/path_test_20120216_Android.s3dxproj/jni/AIModels/path_test_Plugins.cpp
Copied file: C:/Users/Gabriel/Desktop/path_test_23_20120216_Sources/path_test_Plugins.h to: C:/School/495/Publishing/Android/Build_Temp/_S3DTempBuild_/path_test_20120216_Android.s3dxproj/jni/AIModels/path_test_Plugins.h
Copied file: C:/Users/Gabriel/Desktop/path_test_23_20120216_Sources/cam.cpp to: C:/School/495/Publishing/Android/Build_Temp/_S3DTempBuild_/path_test_20120216_Android.s3dxproj/jni/AIModels/cam.cpp
Copied file: C:/Users/Gabriel/Desktop/path_test_23_20120216_Sources/cam.h to: C:/School/495/Publishing/Android/Build_Temp/_S3DTempBuild_/path_test_20120216_Android.s3dxproj/jni/AIModels/cam.h
Copied file: C:/Users/Gabriel/Desktop/path_test_23_20120216_Sources/cam_State_camera_onEnter.cpp to: C:/School/495/Publishing/Android/Build_Temp/_S3DTempBuild_/path_test_20120216_Android.s3dxproj/jni/AIModels/cam_State_camera_onEnter.cpp
Copied file: C:/Users/Gabriel/Desktop/path_test_23_20120216_Sources/cam_State_camera_onLeave.cpp to: C:/School/495/Publishing/Android/Build_Temp/_S3DTempBuild_/path_test_20120216_Android.s3dxproj/jni/AIModels/cam_State_camera_onLeave.cpp
Copied file: C:/Users/Gabriel/Desktop/path_test_23_20120216_Sources/cam_State_camera_onLoop.cpp to: C:/School/495/Publishing/Android/Build_Temp/_S3DTempBuild_/path_test_20120216_Android.s3dxproj/jni/AIModels/cam_State_camera_onLoop.cpp
Copied file: C:/Users/Gabriel/Desktop/path_test_23_20120216_Sources/human.cpp to: C:/School/495/Publishing/Android/Build_Temp/_S3DTempBuild_/path_test_20120216_Android.s3dxproj/jni/AIModels/human.cpp
Copied file: C:/Users/Gabriel/Desktop/path_test_23_20120216_Sources/human.h to: C:/School/495/Publishing/Android/Build_Temp/_S3DTempBuild_/path_test_20120216_Android.s3dxproj/jni/AIModels/human.h
Copied file: C:/Users/Gabriel/Desktop/path_test_23_20120216_Sources/human_State_main_onEnter.cpp to: C:/School/495/Publishing/Android/Build_Temp/_S3DTempBuild_/path_test_20120216_Android.s3dxproj/jni/AIModels/human_State_main_onEnter.cpp
Copied file: C:/Users/Gabriel/Desktop/path_test_23_20120216_Sources/human_State_main_onLeave.cpp to: C:/School/495/Publishing/Android/Build_Temp/_S3DTempBuild_/path_test_20120216_Android.s3dxproj/jni/AIModels/human_State_main_onLeave.cpp
Copied file: C:/Program Files (x86)/Stonetrip/ShiVa Authoring Tool/Data/Windows/Android/Build/S3DX/S3DXAIConstant.h to: C:/School/495/Publishing/Android/Build_Temp/_S3DTempBuild_/path_test_20120216_Android.s3dxproj/jni/S3DX/S3DXAIConstant.h
Copied file: C:/Program Files (x86)/Stonetrip/ShiVa Authoring Tool/Data/Windows/Android/Build/S3DX/S3DXAIEngineAPI.h to: C:/School/495/Publishing/Android/Build_Temp/_S3DTempBuild_/path_test_20120216_Android.s3dxproj/jni/S3DX/S3DXAIEngineAPI.h
Copied file: C:/Program Files (x86)/Stonetrip/ShiVa Authoring Tool/Data/Windows/Android/Build/S3DX/S3DXAIFunction.h to: C:/School/495/Publishing/Android/Build_Temp/_S3DTempBuild_/path_test_20120216_Android.s3dxproj/jni/S3DX/S3DXAIFunction.h
Copied file: C:/Program Files (x86)/Stonetrip/ShiVa Authoring Tool/Data/Windows/Android/Build/S3DX/S3DXAIModel.h to: C:/School/495/Publishing/Android/Build_Temp/_S3DTempBuild_/path_test_20120216_Android.s3dxproj/jni/S3DX/S3DXAIModel.h
Copied file: C:/Program Files (x86)/Stonetrip/ShiVa Authoring Tool/Data/Windows/Android/Build/S3DX/S3DXAIPackage.h to: C:/School/495/Publishing/Android/Build_Temp/_S3DTempBuild_/path_test_20120216_Android.s3dxproj/jni/S3DX/S3DXAIPackage.h
Copied file: C:/Program Files (x86)/Stonetrip/ShiVa Authoring Tool/Data/Windows/Android/Build/S3DX/S3DXAIVariable.h to: C:/School/495/Publishing/Android/Build_Temp/_S3DTempBuild_/path_test_20120216_Android.s3dxproj/jni/S3DX/S3DXAIVariable.h
Copied file: C:/Program Files (x86)/Stonetrip/ShiVa Authoring Tool/Data/Windows/Android/Build/S3DX/S3DXAIVariables.h to: C:/School/495/Publishing/Android/Build_Temp/_S3DTempBuild_/path_test_20120216_Android.s3dxproj/jni/S3DX/S3DXAIVariables.h
Copied file: C:/Program Files (x86)/Stonetrip/ShiVa Authoring Tool/Data/Windows/Android/Build/S3DX/S3DXConfig.h to: C:/School/495/Publishing/Android/Build_Temp/_S3DTempBuild_/path_test_20120216_Android.s3dxproj/jni/S3DX/S3DXConfig.h
Copied file: C:/Program Files (x86)/Stonetrip/ShiVa Authoring Tool/Data/Windows/Android/Build/S3DX/S3DXMacros.h to: C:/School/495/Publishing/Android/Build_Temp/_S3DTempBuild_/path_test_20120216_Android.s3dxproj/jni/S3DX/S3DXMacros.h
Copied file: C:/Program Files (x86)/Stonetrip/ShiVa Authoring Tool/Data/Windows/Android/Build/S3DX/S3DXPlatform.h to: C:/School/495/Publishing/Android/Build_Temp/_S3DTempBuild_/path_test_20120216_Android.s3dxproj/jni/S3DX/S3DXPlatform.h
Copied file: C:/Program Files (x86)/Stonetrip/ShiVa Authoring Tool/Data/Windows/Android/Build/S3DX/S3DXPlugin.h to: C:/School/495/Publishing/Android/Build_Temp/_S3DTempBuild_/path_test_20120216_Android.s3dxproj/jni/S3DX/S3DXPlugin.h
Copied file: C:/Program Files (x86)/Stonetrip/ShiVa Authoring Tool/Data/Windows/Android/Build/S3DX/S3DXTypes.h to: C:/School/495/Publishing/Android/Build_Temp/_S3DTempBuild_/path_test_20120216_Android.s3dxproj/jni/S3DX/S3DXTypes.h
Copied file: C:/Program Files (x86)/Stonetrip/ShiVa Authoring Tool/Data/Windows/Android/Build/app_jni.dat to: C:/School/495/Publishing/Android/Build_Temp/_S3DTempBuild_/path_test_20120216_Android.s3dxproj/jni/S3DClient.cpp
Creating JNI makefile
Creating Application makefile
Creating java files
Created directory: C:/School/495/Publishing/Android/Build_Temp/_S3DTempBuild_/path_test_20120216_Android.s3dxproj/src/com/gabe/test
-----------------------------------------------------------------------------
Building JNI module...
Modules: S3DClient stdc++
    S3DClient:
        depends: stdc++
        MODULE: S3DClient
        MODULE_FILENAME: libS3DClient.so
        PATH: /cygdrive/C/School/495/Publishing/Android/Build_Temp/_S3DTempBuild_/path_test_20120216_Android.s3dxproj/jni
        SRC_FILES:
            S3DClient.cpp
            AIModels/human_State_main_onLoop.cpp
            AIModels/main.cpp
            AIModels/main.h
            AIModels/main_Handler_onInit.cpp
            AIModels/main_Handler_onMouseButtonDown.cpp
            AIModels/path_test_Plugins.cpp
            AIModels/path_test_Plugins.h
            AIModels/cam.cpp
            AIModels/cam.h
            AIModels/cam_State_camera_onEnter.cpp
            AIModels/cam_State_camera_onLeave.cpp
            AIModels/cam_State_camera_onLoop.cpp
            AIModels/human.cpp
            AIModels/human.h
            AIModels/human_State_main_onEnter.cpp
            AIModels/human_State_main_onLeave.cpp
        CFLAGS:
            -O2
            -DANDROID_NDK
        STATIC_LIBRARIES: libstdc++
        LDLIBS:
            C:/School/495/Publishing/Android/Build_Temp/_S3DTempBuild_/path_test_20120216_Android.s3dxproj/obj/local/armeabi/libS3DClientNative_Android.a
            -LC:/School/495/Publishing/Android/Build_Temp/_S3DTempBuild_/path_test_20120216_Android.s3dxproj/obj/local/armeabi
            -lopenal
            -lssl
            -lcrypto
            -lGLESv1_CM
            -ldl
            -llog
        MAKEFILE: /cygdrive/C/School/495/Publishing/Android/Build_Temp/_S3DTempBuild_/path_test_20120216_Android.s3dxproj/jni/Android.mk
        BUILT_MODULE: ./obj/local/armeabi/libS3DClient.so
        OBJS_DIR: ./obj/local/armeabi/objs/S3DClient
        INSTALLED: /cygdrive/C/School/495/Publishing/Android/Build_Temp/_S3DTempBuild_/path_test_20120216_Android.s3dxproj/libs/armeabi/libS3DClient.so
        MODULE_CLASS: SHARED_LIBRARY
    stdc++:
        MODULE: stdc++
        MODULE_FILENAME: libstdc++.a
        PATH: /cygdrive/C/android-ndk-r7b/sources/cxx-stl/system
        EXPORT_LDLIBS: -lstdc++
        EXPORT_C_INCLUDES: /cygdrive/C/android-ndk-r7b/sources/cxx-stl/system/include
        MAKEFILE: /cygdrive/C/android-ndk-r7b/sources/cxx-stl/system/Android.mk
        BUILT_MODULE: ./obj/local/armeabi/libstdc++.a
        OBJS_DIR: ./obj/local/armeabi/objs/stdc++
        MODULE_CLASS: STATIC_LIBRARY
--- end of modules list
Imports for module S3DClient:
CFLAGS=''
CPPFLAGS=''
C_INCLUDES='/cygdrive/C/android-ndk-r7b/sources/cxx-stl/system/include'
All depends='stdc++'
Android NDK: WARNING: Unsupported source file extensions in /cygdrive/C/School/495/Publishing/Android/Build_Temp/_S3DTempBuild_/path_test_20120216_Android.s3dxproj/jni/Android.mk for module S3DClient   
Android NDK:   AIModels/main.h AIModels/path_test_Plugins.h AIModels/cam.h AIModels/human.h   

bash: cannot set terminal process group (-1): Inappropriate ioctl for device
bash: no job control in this shell

Imports for module stdc++:
CFLAGS=''
CPPFLAGS=''
C_INCLUDES=''
All depends=''

Modules: S3DClient stdc++
    S3DClient:
        depends: stdc++
        MODULE: S3DClient
        MODULE_FILENAME: libS3DClient.so
        PATH: /cygdrive/C/School/495/Publishing/Android/Build_Temp/_S3DTempBuild_/path_test_20120216_Android.s3dxproj/jni
        SRC_FILES:
            S3DClient.cpp
            AIModels/human_State_main_onLoop.cpp
            AIModels/main.cpp
            AIModels/main.h
            AIModels/main_Handler_onInit.cpp
            AIModels/main_Handler_onMouseButtonDown.cpp
            AIModels/path_test_Plugins.cpp
            AIModels/path_test_Plugins.h
            AIModels/cam.cpp
            AIModels/cam.h
            AIModels/cam_State_camera_onEnter.cpp
            AIModels/cam_State_camera_onLeave.cpp
            AIModels/cam_State_camera_onLoop.cpp
            AIModels/human.cpp
            AIModels/human.h
            AIModels/human_State_main_onEnter.cpp
            AIModels/human_State_main_onLeave.cpp
        CFLAGS:
            -O2
            -DANDROID_NDK
        STATIC_LIBRARIES: libstdc++
        LDLIBS:
            C:/School/495/Publishing/Android/Build_Temp/_S3DTempBuild_/path_test_20120216_Android.s3dxproj/obj/local/armeabi-v7a/libS3DClientNative_Android.a
            -LC:/School/495/Publishing/Android/Build_Temp/_S3DTempBuild_/path_test_20120216_Android.s3dxproj/obj/local/armeabi-v7a
            -lopenal
            -lssl
            -lcrypto
            -lGLESv1_CM
            -ldl
            -llog
        MAKEFILE: /cygdrive/C/School/495/Publishing/Android/Build_Temp/_S3DTempBuild_/path_test_20120216_Android.s3dxproj/jni/Android.mk
        BUILT_MODULE: ./obj/local/armeabi-v7a/libS3DClient.so
        OBJS_DIR: ./obj/local/armeabi-v7a/objs/S3DClient
        INSTALLED: /cygdrive/C/School/495/Publishing/Android/Build_Temp/_S3DTempBuild_/path_test_20120216_Android.s3dxproj/libs/armeabi-v7a/libS3DClient.so
        MODULE_CLASS: SHARED_LIBRARY
    stdc++:
        MODULE: stdc++
        MODULE_FILENAME: libstdc++.a
        PATH: /cygdrive/C/android-ndk-r7b/sources/cxx-stl/system
        EXPORT_LDLIBS: -lstdc++
        EXPORT_C_INCLUDES: /cygdrive/C/android-ndk-r7b/sources/cxx-stl/system/include
        MAKEFILE: /cygdrive/C/android-ndk-r7b/sources/cxx-stl/system/Android.mk
        BUILT_MODULE: ./obj/local/armeabi-v7a/libstdc++.a
        OBJS_DIR: ./obj/local/armeabi-v7a/objs/stdc++
        MODULE_CLASS: STATIC_LIBRARY
--- end of modules list
Imports for module S3DClient:
CFLAGS=''
CPPFLAGS=''
C_INCLUDES='/cygdrive/C/android-ndk-r7b/sources/cxx-stl/system/include'
All depends='stdc++'
Android NDK: WARNING: Unsupported source file extensions in /cygdrive/C/School/495/Publishing/Android/Build_Temp/_S3DTempBuild_/path_test_20120216_Android.s3dxproj/jni/Android.mk for module S3DClient   
Android NDK:   AIModels/main.h AIModels/path_test_Plugins.h AIModels/cam.h AIModels/human.h   

Imports for module stdc++:
CFLAGS=''
CPPFLAGS=''
C_INCLUDES=''
All depends=''

Gdbserver      : [arm-linux-androideabi-4.4.3] /cygdrive/C/School/495/Publishing/Android/Build_Temp/_S3DTempBuild_/path_test_20120216_Android.s3dxproj/libs/armeabi/gdbserver


Gdbsetup       : /cygdrive/C/School/495/Publishing/Android/Build_Temp/_S3DTempBuild_/path_test_20120216_Android.s3dxproj/libs/armeabi/gdb.setup


Gdbserver      : [arm-linux-androideabi-4.4.3] /cygdrive/C/School/495/Publishing/Android/Build_Temp/_S3DTempBuild_/path_test_20120216_Android.s3dxproj/libs/armeabi-v7a/gdbserver


Gdbsetup       : /cygdrive/C/School/495/Publishing/Android/Build_Temp/_S3DTempBuild_/path_test_20120216_Android.s3dxproj/libs/armeabi-v7a/gdb.setup


Cygwin         : Generating dependency file converter script


Compile++ thumb  : S3DClient <= S3DClient.cpp


Compile++ thumb  : S3DClient <= human_State_main_onLoop.cpp


/cygdrive/C/android-ndk-r7b/build/core/build-binary.mk:243: recipe for target `obj/local/armeabi/objs/S3DClient/AIModels/human_State_main_onLoop.o' failed

In file included from C:/School/495/Publishing/Android/Build_Temp/_S3DTempBuild_/path_test_20120216_Android.s3dxproj/jni/AIModels/human_State_main_onLoop.cpp:2:
C:/School/495/Publishing/Android/Build_Temp/_S3DTempBuild_/path_test_20120216_Android.s3dxproj/jni/AIModels/human.h:24: error: return type specification for constructor invalid
C:/School/495/Publishing/Android/Build_Temp/_S3DTempBuild_/path_test_20120216_Android.s3dxproj/jni/AIModels/human.h:24: error: return type specification for constructor invalid
C:/School/495/Publishing/Android/Build_Temp/_S3DTempBuild_/path_test_20120216_Android.s3dxproj/jni/AIModels/human.h: In constructor 'human::human()':
C:/School/495/Publishing/Android/Build_Temp/_S3DTempBuild_/path_test_20120216_Android.s3dxproj/jni/AIModels/human.h:24: error: returning a value from a constructor
C:/School/495/Publishing/Android/Build_Temp/_S3DTempBuild_/path_test_20120216_Android.s3dxproj/jni/AIModels/human.h: In constructor 'human::human(S3DX::AIVariable)':
C:/School/495/Publishing/Android/Build_Temp/_S3DTempBuild_/path_test_20120216_Android.s3dxproj/jni/AIModels/human.h:24: error: returning a value from a constructor
make: *** [obj/local/armeabi/objs/S3DClient/AIModels/human_State_main_onLoop.o] Error 1

Could not build JNI module


Here is where the problem seems to be:

Code: Select all
Compile++ thumb  : S3DClient <= S3DClient.cpp


Compile++ thumb  : S3DClient <= human_State_main_onLoop.cpp


/cygdrive/C/android-ndk-r7b/build/core/build-binary.mk:243: recipe for target `obj/local/armeabi/objs/S3DClient/AIModels/human_State_main_onLoop.o' failed

In file included from C:/School/495/Publishing/Android/Build_Temp/_S3DTempBuild_/path_test_20120216_Android.s3dxproj/jni/AIModels/human_State_main_onLoop.cpp:2:
C:/School/495/Publishing/Android/Build_Temp/_S3DTempBuild_/path_test_20120216_Android.s3dxproj/jni/AIModels/human.h:24: error: return type specification for constructor invalid
C:/School/495/Publishing/Android/Build_Temp/_S3DTempBuild_/path_test_20120216_Android.s3dxproj/jni/AIModels/human.h:24: error: return type specification for constructor invalid
C:/School/495/Publishing/Android/Build_Temp/_S3DTempBuild_/path_test_20120216_Android.s3dxproj/jni/AIModels/human.h: In constructor 'human::human()':
C:/School/495/Publishing/Android/Build_Temp/_S3DTempBuild_/path_test_20120216_Android.s3dxproj/jni/AIModels/human.h:24: error: returning a value from a constructor
C:/School/495/Publishing/Android/Build_Temp/_S3DTempBuild_/path_test_20120216_Android.s3dxproj/jni/AIModels/human.h: In constructor 'human::human(S3DX::AIVariable)':
C:/School/495/Publishing/Android/Build_Temp/_S3DTempBuild_/path_test_20120216_Android.s3dxproj/jni/AIModels/human.h:24: error: returning a value from a constructor
make: *** [obj/local/armeabi/objs/S3DClient/AIModels/human_State_main_onLoop.o] Error 1


I am using Shiva 1.9.1 PLE right now with the UAT 1.3.1 and have Android NDK r7b, the Android SDK, Eclipse with the plugin, Cygwin, Ant and whatever else the authoring tutorial tells you to do. I really need to figure this out ASAP.

Thank you for your time. ^__^
saphirekosmos
Fresh Boarder
Fresh Boarder
 
Posts: 1

Re: UAT error when trying to build for Android.

Postby Yopia » 24 Feb 2012, 08:12

hi,

You have a cpp error
human.h:24: error: return type specification for constructor invalid.
Check this file to fix it or export your game as simple stk (with lua instead of cpp source)
User avatar
Yopia
Platinum Boarder
Platinum Boarder
 
Posts: 630

Re: UAT error when trying to build for Android.

Postby rusty » 04 Aug 2012, 14:12

I've got a similar issue.

Looking through all the other source files and I can't find an example of a constructor, has anyone got an example for ShiVa so I can try a manual edit please?


And if there is no constructor, how is there a return value?
rusty
Expert Boarder
Expert Boarder
 
Posts: 106

Re: UAT error when trying to build for Android.

Postby broozar » 04 Aug 2012, 14:33

on a sidenote, if you can (if you are a licensed customer), please try the latest UAT 1.4beta4 (you are still running 1.3.1).
User avatar
broozar
Platinum Boarder
Platinum Boarder
 
Posts: 3458
Location: Berlin - Germany

Re: UAT error when trying to build for Android.

Postby rusty » 04 Aug 2012, 14:37

Cheers, i'll try that! (I am)


Q. when compiling C++, will you get errors if you don't handle a return from a function.
i.e. on line 28 in lang.h (previous line), I went into it's function and xml.receive was used but i'd ignored the bool return. I have changed this now but i'm still getting the error, but it's something I could go around checking for...?
rusty
Expert Boarder
Expert Boarder
 
Posts: 106

Re: UAT error when trying to build for Android.

Postby rusty » 04 Aug 2012, 16:40

Nope, beta UAT, same error?

BTW my errors are from Eclipse, the UAT packages fine...
rusty
Expert Boarder
Expert Boarder
 
Posts: 106

Re: UAT error when trying to build for Android.

Postby NiCoX » 04 Aug 2012, 16:47

Hi,

Could you please post the code of the CPP file: AIModels/human.h ?

My guess is that you may have created a function named "human" in the AIModel of the same name, or something similar.
User avatar
NiCoX
Platinum Boarder
Platinum Boarder
 
Posts: 5641
Location: France

Re: UAT error when trying to build for Android.

Postby rusty » 04 Aug 2012, 18:22

NiCoX wrote:Hi,

Could you please post the code of the CPP file: AIModels/human.h ?

My guess is that you may have created a function named "human" in the AIModel of the same name, or something similar.




In mine, I haven't:
http://www.stonetrip.com/developer/forum/viewtopic.php?f=43&t=26332

there is a variable of the same name, but I wouldn't have thought that would cause the issue.
rusty
Expert Boarder
Expert Boarder
 
Posts: 106


Return to Google Android